{"text_format":"1","workbook":"xlsx","n_sheets":5,"sheets":["Aufgaben","mehr Aufgaben","FAQ","Name-ID","hidden"],"not_rendered":{"charts":22,"images":119,"macros":1,"external_links":0,"defined_names":25,"comments":0,"pivot_tables":0},"unopened":[],"bounds":{"document_bytes":16777216,"sheet_cells":100000,"rows_first":2000,"rows_last":500,"rows_between":2000,"halvings":0,"cell_chars":16384,"cell_head_chars":4096},"cells_cut":0,"cells_raw":0,"read":"whole","date_system":"1900"}

{"sheet":"Aufgaben","index":0,"n_rows":555,"n_cols":20,"rows_kept":555,"cut":false,"hidden":false,"merged":[[312,1,313,4],[271,1,272,4]]}
[null,"Trainingslager",null,null,null,null,null,null,null,null,{"$f":"hidden!A1","v":0}]
[]
[null,"Tipp deine persönliche ID-Zahl ein:",null,null,{"$f":"A142","v":0},null,{"$f":"\"Hallo \"&VLOOKUP(ID,'Name-ID'!A2:B40,2)","v":"Hallo Klasse"}]
[null,"(klicke unten in diesem Fenster auf den Reiter \"Name-ID\")"]
[null,"Bearbeite dann händisch die Aufgaben. Trage deine Ergebnisse in die gelben Felder ein. "]
[null,"Wenn du richtig liegst, solltest du auch eine Bestätigung bekommen."]
[null,"Troubleshooting: Siehe die Seite FAQ (Reiter unten am Bildschirmrand) oder klicke:",null,null,null,null,"HIER",null,"Links:"]
[]
[null,"Kapitel",null,null,null,null,null,null,null,null,null,null,null,null,"Fime (auf youtube)"]
[1,"Lineare Funktionen",null,null,null,null,null,null,"mathebaustelle",null,null,null,null,null,"Playlist Mathehoch13",null,null,"Links zum Thema lineare Gleichungen"]
[2,"quadratische Gleichungen",null,null,null,null,null,null,"mathebaustelle",null,null,null,null,null,"Playlist Mathehhoch^3",null,null,"Links zum Thema quadratische Gleichungen"]
[3,"quadratische Funktionen",null,null,null,null,null,null,null,null,null,null,null,null,"Playlist Mathehhoch^3"]
[4,"Lineare Gleichungssysteme",null,null,null,null,null,null,"mathebaustelle"]
[5,"Steckbriefaufgaben",null,null,null,null,null,null,"Glossar: Steckbriefaufgabe"]
[6,"Das Muster der Steigungen"]
[7,"Differentialrechnung"]
[8,"Umgang mit dem CAS (Funktionen)"]
[9,"Bäume"]
[10,"Zufallsvariablen",null,null,null,null,null,null,null,null,null,null,null,null,"Playlist Mathehoch13"]
[11,"Binomialverteilung",null,null,null,null,null,null,"Glossar: Binomialverteilujng",null,null,null,null,null,"Playlist Mathehoch13"]
[12,"Erwartungswert und Streuung bei Stichproben"]
[20,"Vektorrechnung"]
[21,"Matrizenrechnung"]
[]
[]
[]
[]
[1,"Lineare Funktionen",null,null,null,null,null,null,"Video","Playlist Mathehoch13"]
[null,null,null,null,null,null,null,null,"Thema: lineare Funktionen",null,null,null,null,null,null,"auf mathebaustelle.de"]
[{"$f":"hidden!E4","v":"Aufgabe 1"},"Löse die Gleichung:"]
{"$rows_left_out":526}
{"sheet":"mehr Aufgaben","index":1,"n_rows":273,"n_cols":18,"rows_kept":273,"cut":false,"hidden":false,"merged":[]}
[{"$f":"Aufgaben!G3","v":"Hallo Klasse"}]
[9,"Baumdiagramme"]
[]
["a)","Vervollständige das Baumdiagramm.",null,null,null,"Runde die Ergebnisse auf vier Nachkommastellen."]
[]
[null,null,null,null,{"$f":"hidden!G758","v":3.2500000000000001E-2},"B"]
[null,null,null,null,null,null,{"$f":"hidden!I759","v":""}]
[null,null,{"$f":"hidden!E760","v":0.01},"A"]
[]
[]
[null,null,null,null,{"$f":"hidden!G763","v":""},null,{"$f":"hidden!I763","v":""}]
[null,null,null,null,null,"B"]
[null,null,null,null,{"$f":"hidden!G765","v":""},null,{"$f":"hidden!I765","v":""}]
[]
[null,null,{"$f":"hidden!E767","v":""}]
[null,null,null,null,{"$f":"hidden!G768","v":1.2500000000000001E-2}]
[null,null,null,null,null,null,{"$f":"hidden!I769","v":""}]
[]
[null,null,null,null,null,null,"(Ja / Nein)"]
["b)","Sind A und B stochastisch unabhängig?"]
[null,null,null,null,null,null,{"$f":"hidden!I773","v":""}]
["c)","Erstelle die zugehörige Vierfeldertafel."]
[]
[null,null,null,null,"B",null,"Summe"]
[null,null,null,"A"]
[]
[null,null,null,"Summe",null,null,1]
[null,null,null,null,{"$f":"hidden!G780","v":""},{"$f":"hidden!H780","v":""},{"$f":"hidden!I780","v":""}]
[]
["d) ","Erstelle den umgedrehten Baum."]
{"$rows_left_out":244}
{"sheet":"FAQ","index":2,"n_rows":44,"n_cols":8,"rows_kept":44,"cut":false,"hidden":false,"merged":[]}
[]
[]
["Hilfe: Irgendwas klappt nicht!!"]
["Das kann sein: Erster Hauptsatz der Theoretischen Informatik: Jedes hinreichend komplexe Programm hat Bugs und irgendwas geht immer schief."]
["Wenn Aufgaben gar nicht richtig dargestellt werden und komische Fehlermeldungen erscheinen: "]
["Am Besten bescheid sagen!"]
["Wenn die Aufgaben abgegeben werden müssen oder du dringend weiterarbeiten willst: Lass dich nicht aufhalten!"]
["Gib als Schüler*innen-Nummer eingfach z.B. die 40 ein und schau, ob das Probelm bei dem Aufgabensatz auch besteht. "]
["Wenn nicht kannst du ja ersatzweise den machen."]
[]
["ABER ICH KANN GAR NICHTS BEARBEITEN - MEINE EINTRÄGE WERDEN NICHT ANGENOMMEN!!!"]
["Hast du vielleicht die Excel-Datei in Teams geöffnet? Das klappt oft nicht. Lade sie auf dein Gerät herunter. Dann müsste alles gehen."]
["TUT ES ABER NICHT!"]
["Dann Plan B: Unter",null,"www.mathebaustelle.de/excel/aufg_fuer_schueler_neu1.xlsm",null,null,null,null,"findest du die aktuelle Version, nur ohne deinen persönlichen Namen."]
["Lad diese Version runter und löse die Aufgaben unter deiner Schüler*innen-Nummer."]
[]
["Ich geb eine Dezimalzahl mit Nachkommastellen ein und krieg nicht, was ich will!"]
["Möglicherweise hast du versehentlich die Zahl - z.B. 2,5 - versehentlich mit Punkt statt Komma eingegeben - also 2.5 (2Punkt5). Excel versteht es dann nicht."]
[]
["Ich geb einen Bruch ein und krieg nicht, was ich will!"]
["In Excel mus man bei der Eingabe eines Bruchs mit einem Gleichheitszeichen starten. Gib statt 1/4 ein: =1/4"]
[]
["Ein DATUM?? Ich gebe eine Zahl in eine Antwortzelle ein, aber es erscheint immer ein Datum!"]
["Möglicherweise hast du die Zahl - z.B. 2,5 - versehentlich mit Punkt statt Komma eingegeben - also 2.5 (2Punkt5)."]
["Excel hält das dann für ein Datum. Aus irgendwelchen Gründen merkt sich Excel außerdem, dass das eine Zelle für Datumsangaben ist. Also kann man es nicht so einfach korrigieren."]
["Erster Fix: Schreib das richtige Ergebnis einfach in eine andere leere Zelle - am besten direkt links oder rechts davon. Jetzt hast du schon mal mathematisch alles richtig und man kann das ja auch sehen. "]
["Wenn es dich stört, dass du kein \"richtig\" bekommst, mach Folgendes:"]
["Kopiere die neu eingetippte Lösungszelle über die \"Datumszelle\". Müsste klappen!"]
["ODER du formatierst die Zelle und legst das Format \"Zahl\" fest."]
[]
{"$rows_left_out":15}
{"sheet":"Name-ID","index":3,"n_rows":31,"n_cols":2,"rows_kept":31,"cut":false,"hidden":false,"merged":[]}
[]
[0,"Klasse"]
[1,{"$f":"C3","v":0}]
[{"$f":"A3+1","v":2},{"$f":"C4","v":0}]
[{"$f":"A4+1","v":3},0]
[4,0]
[5,0]
[6,0]
[7,0]
[8,0]
[9,0]
[10,0]
[11,0]
[12,0]
[13,0]
[14,0]
[15,0]
[16,0]
[17,0]
[18,0]
[19,0]
[20,0]
[21,0]
[22,0]
[23,0]
[24,0]
[25,0]
[26,0]
[27,0]
[28,0]
{"$rows_left_out":2}
{"sheet":"hidden","index":4,"n_rows":1071,"n_cols":90,"rows_kept":1071,"cut":false,"hidden":true,"merged":[]}
[{"$f":"SUM(B:B)","v":0},null,null,null,"Mit Ctrl-y kann man die Zufallswahlen festtackern und den back-End Bereich \"hidden\" verstecken. Es wird eine Schüler*innen-Datei abgespeichert, ohne das diese Datei \"zerstört wird\".",null,null,null,null,null,null,null,null,null,null,null,null,null,null,null,null,null,"Umsortierung",null,null,null,null,2,6,7,8,9,10,10,11,12,13,14,14,15,16,17,18,19,20,21,22,22,23,23,24,25,26,27,27,28,29,30,31,32,33,34,35,36,37,37,38,39,40,41,48,64,69,73,76,82,84]
[null,null,null,null,"Mit alt-F8 kann man Makros und vba-Programme aufrufen."]
["1 Lineare Funktionen"]
[1,{"$f":"IF(G4<>\"\",1,0)","v":0},null,null,{"$f":"\"Aufgabe \"&A4","v":"Aufgabe 1"},null,{"$f":"IF(Aufgaben!E31*N6+O6=P6,\"korrekt!\",\"\")","v":""},null,5,null,null,null,null,null,null,null,null,null,null,null,null,null,null,null,null,null,null,null,null,null,null,null,null,null,null,null,null,null,null,null,null,null,null,null,null,null,null,null,null,null,null,null,null,null,null,null,null,null,null,null,null,null,null,null,null,null,null,null,null,null,null,null,null,null,null,null,null,null,null,null,null,null,null,"Klasse",null,"12NP","MQE-Kurs","13NP","11GT1","Leute"]
[null,null,"a",null,{"$f":"IF(N6<0,\" - \",\"\")&IF(N6=0,\"\",IF(ABS(N6)=1,\" x \",ABS(N6)&\" x \"))&IF(O6>0,IF(O6<>0,\" + \",\"\"),\"\")&IF(O6<0,\" - \",\"\")&IF(O6=0,\"\",IF(ABS(O6)=1,\" 1 \",ABS(O6)&\"\"))&\" = \"&P6","v":"5 x  - 6 = 14"},null,null,null,null,null,null,null,null,null,null,{"$f":"HLOOKUP(ID,$AA$5:$CB$8,2)","v":4},null,null,null,null,null,null,null,null,null,null,0,41,1,2,3,4,5,48,6,7,8,9,43,10,11,12,13,14,15,16,17,39,18,50,19,20,21,22,45,23,24,25,26,27,28,29,30,31,32,47,33,34,35,36,46,42,38,44,37,40,49,51,52,53,54,55,56,"Schüler*in 1",null,"Junaid ","Andreas","Sami","Lena","Peter"]
[null,null,null,null,null,null,null,null,null,null,null,null,null,{"$f":"HLOOKUP(ID,$AA$5:$CB$8,3)","v":5},{"$f":"HLOOKUP(ID,$AA$5:$CB$8,4)","v":-6},{"$f":"N6*P5+O6","v":14},null,null,null,null,null,null,null,null,null,null,4,-5,-10,5,-9,-10,8,4,-5,-4,2,12,6,1,-12,2,8,-12,9,8,10,-11,-2,-10,-1,-3,6,6,9,-7,5,5,-6,-1,-2,-12,2,-10,-12,-3,-7,-9,7,-8,12,-11,11,10,2,9,-10,-11,5,-6,{"$f":"RANDBETWEEN(1,12)*(-1)^RANDBETWEEN(1,2)","v":10},{"$f":"RANDBETWEEN(1,12)*(-1)^RANDBETWEEN(1,2)","v":-6},{"$f":"RANDBETWEEN(1,12)*(-1)^RANDBETWEEN(1,2)","v":7},{"$f":"\"Schüler*in \"&CE6","v":"Schüler*in 7"},null,"Jasmin","Georgios","Can","Lara","Gwen"]
[null,null,"UNFERTIG",null,null,null,null,null,null,null,null,null,null,null,null,null,null,null,null,null,null,null,null,null,null,null,5,1,4,5,6,2,4,-6,-4,-3,6,1,2,-1,5,-4,5,3,5,-3,-2,6,-2,3,3,-4,1,-3,1,3,1,5,-2,3,-4,1,3,5,-3,2,-4,-6,-5,-3,4,3,1,3,-4,6,-4,-3,-1,5,{"$f":"RANDBETWEEN(1,6)*(-1)^RANDBETWEEN(1,2)","v":6},{"$f":"RANDBETWEEN(1,6)*(-1)^RANDBETWEEN(1,2)","v":5},{"$f":"RANDBETWEEN(1,6)*(-1)^RANDBETWEEN(1,2)","v":3},{"$f":"\"Schüler*in \"&CE7","v":"Schüler*in 3"},null,"Jonathan","Monika","Marvin","Mia","M.J."]
[null,null,"b",null,{"$f":"IF(N9<0,\" - \",\"\")&IF(N9=0,\"\",IF(ABS(N9)=1,\" x \",ABS(N9)&\" x \"))&IF(O9>0,IF(O9<>0,\" + \",\"\"),\"\")&IF(O9<0,\" - \",\"\")&IF(O9=0,\"\",IF(ABS(O9)=1,\" 1 \",ABS(O9)&\"\"))&\" = \"&IF(P9<0,\" - \",\"\")&IF(P9=0,\"\",IF(ABS(P9)=1,\" x \",ABS(P9)&\" x \"))&IF(Q9>0,IF(Q9<>0,\" + \",\"\"),\"\")&IF(Q9<0,\" - \",\"\")&IF(Q9=0,\"\",IF(ABS(Q9)=1,\" 1 \",ABS(Q9)&\"\"))","v":"9 x  - 4 = 32 x  + 12"},null,null,null,null,null,null,null,null,null,null,{"$f":"HLOOKUP(ID,$AA$5:$CB$8,2)","v":4},null,null,null,null,null,null,null,null,null,null,-6,-3,-3,7,-11,9,-12,12,-6,-11,-2,6,4,9,-11,-4,-1,10,-8,9,-5,-11,-12,-1,10,-8,6,-8,11,-12,10,-12,-1,-5,-11,11,-5,1,8,10,-2,1,7,5,5,3,5,-4,-12,8,-11,-6,-9,3,{"$f":"RANDBETWEEN(1,12)*(-1)^RANDBETWEEN(1,2)","v":5},{"$f":"RANDBETWEEN(1,12)*(-1)^RANDBETWEEN(1,2)","v":-3},{"$f":"RANDBETWEEN(1,12)*(-1)^RANDBETWEEN(1,2)","v":11},"Schüler*in 11",null,"Theo ","Baykal","Louis","Franzi","Harry"]
[null,null,null,null,null,null,null,null,null,null,null,null,null,{"$f":"HLOOKUP(ID,$AA$14:$CB$20,3)","v":9},{"$f":"HLOOKUP(ID,$AA$14:$CB$20,4)","v":-4},{"$f":"N9*P8+O9","v":32},12,null,null,null,null,null,null,null,null,null,0,1,2,3,4,5,6,7,8,9,10,11,12,13,14,15,16,17,18,19,20,21,22,23,24,25,26,27,28,29,30,31,32,33,34,35,36,37,38,39,40,41,42,43,44,45,46,47,48,49,50,51,52,53,{"$f":"CB9+1","v":54},{"$f":"CC9+1","v":55},{"$f":"CD9+1","v":56},"Schüler*in 56",null,"Shirine ","Nevzat","Bilal","Anika","Miles"]
[null,null,null,null," ",null,null,null,null,null,null,null,null,null,null,null,null,null,null,null,null,null,null,null,null,null,-5,-4,0,2,-12,0,-4,3,4,9,-3,4,-10,6,-6,4,6,9,-7,5,-12,16,-6,5,8,1,-6,7,1,-8,-15,-5,-1,9,5,-10,6,17,3,5,15,12,6,16,7,-7,-9,16,-8,4,11,-14,-8,1,{"$f":"RANDBETWEEN(1,6)*(-1)^RANDBETWEEN(1,2)+CC11","v":-9},{"$f":"RANDBETWEEN(1,6)*(-1)^RANDBETWEEN(1,2)+CD11","v":13},{"$f":"RANDBETWEEN(1,6)*(-1)^RANDBETWEEN(1,2)+CE11","v":5},"Schüler*in 5",null,"Finn","Thomas","Joshua","Mika","Rio"]
[null,null,null,null,null,null,null,null,null,null,null,null,null,null,null,null,null,null,null,null,null,null,null,null,null,null,-4,-1,2,-4,-10,-2,-3,-1,8,5,-2,2,-9,10,-10,-1,12,10,-12,7,-6,11,-8,2,11,6,-10,6,3,-6,-10,1,-4,10,9,-8,2,11,1,9,10,6,10,12,1,-3,-3,11,-7,6,5,-10,-4,-1,{"$f":"RANDBETWEEN(1,12)*(-1)^RANDBETWEEN(1,2)","v":-3},{"$f":"RANDBETWEEN(1,12)*(-1)^RANDBETWEEN(1,2)","v":9},{"$f":"RANDBETWEEN(1,12)*(-1)^RANDBETWEEN(1,2)","v":8},"Schüler*in 8",null,"Kris","Jan","Erik","Juna","Ganke"]
[null,null,null,null,null,null,null,null,null,null,null,null,null,null,null,null,null,null,null,null,null,null,null,null,null,null,3,6,-3,-5,1,-3,3,-4,6,-3,2,-3,3,6,3,-5,-4,2,3,-4,6,3,2,2,1,4,2,2,-1,-2,2,5,5,5,1,3,-1,-3,5,-4,3,-4,3,-2,-6,5,3,-4,-3,3,1,1,-2,1,{"$f":"RANDBETWEEN(1,6)*(-1)^RANDBETWEEN(1,2)","v":6},{"$f":"RANDBETWEEN(1,6)*(-1)^RANDBETWEEN(1,2)","v":1},{"$f":"RANDBETWEEN(1,6)*(-1)^RANDBETWEEN(1,2)","v":2},"Schüler*in 2",null,"Yessine","Birthe","Lars","Rabea","Hailey"]
[2,null,null,null,{"$f":"\"Aufgabe \"&A13","v":"Aufgabe 2"},null,null,null,null,null,null,null,null,null,null,null,null,null,null,null,null,null,null,null,null,null,9,-2,-12,-10,1,-4,-9,-2,1,3,-6,-11,10,2,-3,6,-1,-4,5,-11,9,12,-9,-6,4,11,-2,8,-4,-4,9,-5,-2,-1,-4,4,12,-7,5,4,-1,5,-5,9,7,-1,-12,12,-2,-8,-12,-2,3,5,{"$f":"RANDBETWEEN(1,12)*(-1)^RANDBETWEEN(1,2)","v":-1},{"$f":"RANDBETWEEN(1,12)*(-1)^RANDBETWEEN(1,2)","v":-9},{"$f":"RANDBETWEEN(1,12)*(-1)^RANDBETWEEN(1,2)","v":9},"Schüler*in 9",null,"Colin","Andre","Gianluca","Lisbeth","Brian Michael"]
[null,null,null,null,{"$f":"\"Gegeben ist g mit g(x) = \"&IF(N14<0,\" - \",\"\")&IF(N14=0,\"\",IF(ABS(N14)=1,\" x \",ABS(N14)&\" x \"))&IF(O14>0,IF(O14<>0,\" + \",\"\"),\"\")&IF(O14<0,\" - \",\"\")&IF(O14=0,\"\",IF(ABS(O14)=1,\" 1 \",ABS(O14)&\"\"))","v":"Gegeben ist g mit g(x) = 3 x  + 9"},null,null,null,null,null,null,{"$f":"HLOOKUP(ID,$AA$9:$CB$13,2)","v":-5},null,{"$f":"HLOOKUP(ID,$AA$9:$CB$13,4)","v":3},{"$f":"HLOOKUP(ID,$AA$9:$CB$13,5)","v":9},{"$f":"N14*L14+O14","v":-6},null,null,null,null,null,null,null,null,null,null,0,41,1,2,3,4,5,48,6,7,8,9,43,10,11,12,13,14,15,16,17,39,18,50,19,20,21,22,45,23,24,25,26,27,28,29,30,31,32,47,33,34,35,36,46,42,38,44,37,40,49,51,52,53,54,55,56,{"$f":"\"Schüler*in \"&CE15","v":"Schüler*in 4"},null,"Enno","Michaela","Marvin","Jessie","Steve"]
[null,null,null,null,{"$f":"IF(N14<0,\" - \",\"\")&IF(N14=0,\"\",IF(ABS(N14)=1,\" x \",ABS(N14)&\" x \"))&IF(O14>0,IF(O14<>0,\" + \",\"\"),\"\")&IF(O14<0,\" - \",\"\")&IF(O14=0,\"\",IF(ABS(O14)=1,\" 1 \",ABS(O14)&\"\"))","v":"3 x  + 9"},null,null,null,null,null,null,{"$f":"HLOOKUP(ID,$AA$9:$CB$13,3)","v":-4},null,{"$f":"HLOOKUP(ID,$AA$9:$CB$13,4)","v":3},{"$f":"HLOOKUP(ID,$AA$9:$CB$13,5)","v":9},{"$f":"N15*L15+O15","v":-3},null,null,null,null,null,null,null,null,null,null,6,4,6,-2,-6,-2,5,1,-2,1,-1,-6,5,5,-2,-6,3,-2,-1,-3,-2,4,4,5,-3,1,-4,-6,6,3,2,1,4,2,4,1,1,1,5,-5,-6,-1,-4,5,-4,-1,-2,-4,-2,-4,-4,1,-6,1,{"$f":"RANDBETWEEN(1,6)*(-1)^RANDBETWEEN(1,2)","v":-2},{"$f":"RANDBETWEEN(1,6)*(-1)^RANDBETWEEN(1,2)","v":5},{"$f":"RANDBETWEEN(1,6)*(-1)^RANDBETWEEN(1,2)","v":4},{"$f":"\"Schüler*in \"&CE16","v":"Schüler*in 9"},null,"Artur","Nadine","Stephanie","Ilvy","Roy"]
[null,{"$f":"IF(G16<>\"\",1,0)","v":0},"a",null,"Gib den y-Achsenabschnitt von g an:",null,{"$f":"IF((Aufgaben!E36-O14)=0,\"korrekt!\",\"\")","v":""},null,null,null,null,null,null,null,null,null,null,null,null,null,null,null,null,null,null,null,9,5,9,2,-5,2,6,3,2,3,0,0,8,7,4,-3,8,0,2,0,0,7,5,7,2,7,-1,-3,11,4,6,5,5,8,5,4,4,6,11,-2,0,5,-3,6,2,4,0,-1,1,2,-3,2,-4,5,{"$f":"CC15+CC19","v":-1},{"$f":"CD15+CD19","v":10},{"$f":"CE15+CE19","v":9},{"$f":"\"Schüler*in \"&CE17","v":"Schüler*in -7"},null,null,null,null,"Hanna"]
[null,{"$f":"IF(G17<>\"\",1,0)","v":0},"b",null,"Gib die Steigung von g an:",null,{"$f":"IF((Aufgaben!E37-N14)=0,\"korrekt!\",\"\")","v":""},null,null,null,null,null,null,null,null,null,null,null,null,null,null,null,null,null,null,null,-4,11,12,8,-1,-5,-3,-2,-10,-2,11,6,-2,11,-9,10,-6,6,11,2,-3,6,-3,2,11,2,5,1,4,-6,5,4,-4,10,3,-9,1,4,-2,11,-9,1,-6,-8,-5,-5,3,-6,-11,-4,-12,2,7,8,{"$f":"RANDBETWEEN(1,12)*(-1)^RANDBETWEEN(1,2)","v":-6},{"$f":"RANDBETWEEN(1,12)*(-1)^RANDBETWEEN(1,2)","v":-5},{"$f":"RANDBETWEEN(1,12)*(-1)^RANDBETWEEN(1,2)","v":-7},"Schüler*in -11",null,null,null,null,"Merle"]
[null,{"$f":"IF(G18<>\"\",1,0)","v":0},"c",null,{"$f":"\"Welchen Wert nimmt g an der Stelle \"&L14&\" an?\"","v":"Welchen Wert nimmt g an der Stelle -5 an?"},null,{"$f":"IF(Aufgaben!E38=N14*L14+O14,\"korrekt!\",\"\")","v":""},null,null,null,null,null,null,null,null,null,null,null,null,null,null,null,null,null,null,null,2,-7,-4,-10,-2,11,-1,6,3,-10,1,-8,6,-6,10,7,2,-10,-6,-4,8,-1,-11,5,4,-4,6,-9,-1,6,-7,-3,5,-6,4,11,6,-1,-8,7,-3,2,5,8,-5,6,3,7,11,12,-2,12,-11,-2,{"$f":"RANDBETWEEN(1,12)*(-1)^RANDBETWEEN(1,2)","v":-6},-6,-11,"Schüler*in 5",null,null,null,null,"Jelita"]
[null,{"$f":"IF(G19<>\"\",1,0)","v":0},"d",null,{"$f":"\"An welcher Stelle nimmt g den Wert \"&P15&\" an?\"","v":"An welcher Stelle nimmt g den Wert -3 an?"},null,{"$f":"IF((Aufgaben!E39-L15)=0,\"korrekt!\",\"\")","v":""},null,null,null,null,null,null,null,null,null,null,null,null,null,null,null,null,null,null,null,3,1,3,4,1,4,1,2,4,2,1,6,3,2,6,3,5,2,3,3,2,3,1,2,5,6,3,3,5,1,4,4,1,6,1,3,3,5,6,3,6,6,1,1,6,5,2,3,3,6,1,1,2,4,{"$f":"RANDBETWEEN(1,6)","v":1},{"$f":"RANDBETWEEN(1,6)","v":5},{"$f":"RANDBETWEEN(1,6)","v":5},"Schüler*in ",null,null,null,null,"Oskar"]
[null,null,null,null,null,null,null,null,null,null,null,null,null,null,null,null,null,null,null,null,null,null,null,null,null,null,null,null,null,null,null,null,null,null,null,null,null,null,null,null,null,null,null,null,null,null,null,null,null,null,null,null,null,null,null,null,null,null,null,null,null,null,null,null,null,null,null,null,null,null,null,null,null,null,null,null,null,null,null,null,null,null,null,"Schüler*in ",null,"Alek","Franz-Peter","Lasse","Carolin","Sue"]
[null,null,null,null,null,null,null,null,null,null,null,null,null,null,null,null,null,null,null,null,null,null,null,null,null,null,null,null,null,null,null,null,null,null,null,null,null,null,null,null,null,null,null,null,null,null,null,null,null,null,null,null,null,null,null,null,null,null,null,null,null,null,null,null,null,null,null,null,null,null,null,null,null,null,null,null,null,null,null,null,null,null,null,"Schüler*in ",null,"Marion","Susanne","Ferdinand","Nico","Kamala"]
[null,null,null,null,null,null,null,null,null,null,null,null,null,null,null,null,null,null,null,null,null,null,null,null,null,null,null,null,null,null,null,null,null,null,null,null,null,null,null,null,null,null,null,null,null,null,null,null,null,null,null,null,null,null,null,null,null,null,null,null,null,null,null,null,null,null,null,null,null,null,null,null,null,null,null,null,null,null,null,null,null,null,null,"Schüler*in ",null,"Salmane","Andreas","Orlando","Anna","Natasha"]
[3,null,null,null,{"$f":"\"Aufgabe \"&A23","v":"Aufgabe 3"},null,null,null,null,null,null,null,null,null,null,null,null,null,null,null,null,null,null,null,null,null,0,41,1,2,3,4,5,48,6,7,8,9,43,10,11,12,13,14,15,16,17,39,18,50,19,20,21,22,45,23,24,25,26,27,28,29,30,31,32,47,33,34,35,36,46,42,38,44,37,40,49,51,52,53,54,55,56,"Schüler*in 56",null,"Lea","Sandra","Robert","Laura","Clint"]
[null,{"$f":"IF(G24<>\"\",1,0)","v":0},null,null,"Gerade","m",{"$f":"IF(ISBLANK(Aufgaben!E46),\"\",IF((Aufgaben!E46-N24)=0,\"korrekt!\",\"\"))","v":""},null,null,null,null,{"$f":"HLOOKUP(ID,$AA$23:$CB$27,2)","v":-4},null,{"$f":"HLOOKUP(ID,$AA$23:$CB$27,4)","v":-2},{"$f":"HLOOKUP(ID,$AA$23:$CB$27,5)","v":9},{"$f":"N24*L24+O24","v":17},null,{"$f":"IF(N24<0,\"-\",\"\")&IF(N24=0,\"\",IF(ABS(N24)=1,\"x\",ABS(N24)&\"x\"))&IF(O24>0,IF(O24<>0,\"+\",\"\"),\"\")&IF(O24<0,\"-\",\"\")&IF(O24=0,\"\",IF(ABS(O24)=1,\"1\",ABS(O24)&\"\"))","v":"-2x+9"},null,null,null,null,null,null,null,null,-4,10,-10,5,-1,-1,3,8,-5,4,-4,9,-3,-12,8,8,11,14,-6,5,0,5,1,-6,0,-10,-8,3,3,-8,1,-6,7,-1,-9,-1,12,-14,-10,16,-1,-8,-2,11,-4,14,-2,9,-5,-4,-13,-13,-2,-5,{"$f":"RANDBETWEEN(1,6)*(-1)^RANDBETWEEN(1,2)+CC25","v":-1},{"$f":"RANDBETWEEN(1,6)*(-1)^RANDBETWEEN(1,2)+CD25","v":8},{"$f":"RANDBETWEEN(1,6)*(-1)^RANDBETWEEN(1,2)+CE25","v":14},"Schüler*in 14",null,"Aaron","Olaf","Ronja","Viktoria","Carol"]
[null,{"$f":"IF(G25<>\"\",1,0)","v":0},null,null,{"$f":"\"die durch die Punkte (\"&L24&\"|\"&P24&\") und (\"&L25&\"|\"&P25&\") geht.\"","v":"die durch die Punkte (-4|17) und (1|7) geht."},"b",{"$f":"IF(ISBLANK(Aufgaben!E47),\"\",IF((Aufgaben!E47-O24)=0,\"korrekt!\",\"\"))","v":""},null,null,null,null,{"$f":"HLOOKUP(ID,$AA$23:$CB$27,3)","v":1},null,{"$f":"N24","v":-2},{"$f":"O24","v":9},{"$f":"N25*L25+O25","v":7},null,null,null,null,null,null,null,null,null,null,1,11,-5,7,-4,-7,-2,12,-10,5,-7,8,-9,-7,12,7,7,12,-11,9,5,3,-3,-1,4,-5,-10,9,1,-9,-1,-2,6,4,-11,-7,9,-8,-6,11,-5,-12,-6,12,-2,12,-6,4,-11,-3,-12,-7,-4,-11,{"$f":"RANDBETWEEN(1,12)*(-1)^RANDBETWEEN(1,2)","v":-7},{"$f":"RANDBETWEEN(1,12)*(-1)^RANDBETWEEN(1,2)","v":5},{"$f":"RANDBETWEEN(1,12)*(-1)^RANDBETWEEN(1,2)","v":12},"Schüler*in 12",null,"Maximilian","Julia","Henry","Kornelia","Wanda"]
[null,{"$f":"IF(G26<>\"\",1,0)","v":0},null,null,{"$f":"\"(\"&L24&\"|\"&P24&\") und (\"&L25&\"|\"&P25&\")\"","v":"(-4|17) und (1|7)"},"g(x)",{"$f":"IF((Aufgaben!B49=\"g(x)=\"&R24),\"korrekt!\",\"\")&IF((Aufgaben!B49=R24),\"Schreib davor:g(x)=\",\"\")","v":""},null,null,null,null,null,null,null,null,null,null,null,null,null,null,null,null,null,null,null,-2,1,1,-6,3,-5,5,2,2,1,3,4,5,2,3,-5,-3,2,4,-6,2,4,-4,-4,4,3,-3,-3,-2,-5,-1,3,1,5,3,-1,2,1,-2,-4,-6,-2,-3,-5,6,-5,1,2,1,2,2,4,3,5,{"$f":"RANDBETWEEN(1,6)*(-1)^RANDBETWEEN(1,2)","v":-3},{"$f":"RANDBETWEEN(1,6)*(-1)^RANDBETWEEN(1,2)","v":6},{"$f":"RANDBETWEEN(1,6)*(-1)^RANDBETWEEN(1,2)","v":-1},"Schüler*in -1",null,"Ewelina","Kamilla","Ben","Antonina=Ann","Scott"]
[null,null,null,null,null,null,null,null,null,null,null,null,null,null,null,null,null,null,null,null,null,null,null,null,null,null,9,1,5,-6,11,8,-9,-7,-7,7,-9,-12,-5,11,-8,-2,10,-11,-4,10,10,-1,-10,11,11,7,-10,12,-10,-11,-11,-2,4,-7,-10,8,12,-11,-6,4,-8,4,-11,-1,-7,-11,-8,11,2,6,10,-6,-11,-6,{"$f":"RANDBETWEEN(1,12)*(-1)^RANDBETWEEN(1,2)","v":2},{"$f":"RANDBETWEEN(1,12)*(-1)^RANDBETWEEN(1,2)","v":3},{"$f":"RANDBETWEEN(1,12)*(-1)^RANDBETWEEN(1,2)","v":8},"Schüler*in 8",null,"Laurin","Karla","wer auch immer","Alina","T-Challa"]
["2 Quadratische Gleichungen",null,null,null,null,null,null,null,null,null,null,null,null,null,null,null,null,null,null,null,null,null,null,null,null,null,null,null,null,null,null,null,null,null,null,null,null,null,null,null,null,null,null,null,null,null,null,null,null,null,null,null,null,null,null,null,null,null,null,null,null,null,null,null,null,null,null,null,null,null,null,null,null,null,null,null,null,null,null,null,null,null,null,"Schüler*in ",null,"Jan","Jan",null,"Paula","Mantis"]
[null,null,null,null,null,null,null,null,null,null,null,null,null,null,null,null,null,null,null,null,null,null,null,null,null,null,null,null,null,null,null,null,null,null,null,null,null,null,null,null,null,null,null,null,null,null,null,null,null,null,null,null,null,null,null,null,null,null,null,null,null,null,null,null,null,null,null,null,null,null,null,null,null,null,null,null,null,null,null,null,null,null,null,{"$f":"\"Schüler*in \"&CE30","v":"Schüler*in "},null,"Nabil","Corina",null,"Mira","wer auch immer"]
[1,null,null,null,{"$f":"\"Aufgabe \"&A30","v":"Aufgabe 1"},null,null,null,null,null,null,null,null,null,null,null,null,null,null,null,null,null,null,null,null,null,null,null,null,null,null,null,null,null,null,null,null,null,null,null,null,null,null,null,null,null,null,null,null,null,null,null,null,null,null,null,null,null,null,null,null,null,null,null,null,null,null,null,null,null,null,null,null,null,null,null,null,null,null,null,null,null,null,"Schüler*in 56",null,"Fabienne ","Sinan",null,"wer auch immer"]
{"$rows_left_out":1041}